Skip to content

feat(core): Support SuppressedError in LinkedErrors integration #61470

feat(core): Support SuppressedError in LinkedErrors integration

feat(core): Support SuppressedError in LinkedErrors integration #61470

Re-run triggered October 14, 2026 07:51
Status Failure
Total duration 11m 44s
Artifacts 1

build.yml

on: pull_request
Get CI Metadata  /  Get Metadata
7s
Get CI Metadata / Get Metadata
Check lockfile
0s
Check lockfile
Check file formatting
33s
Check file formatting
Check PR branches
2s
Check PR branches
Build Lambda layer
1m 9s
Build Lambda layer
Matrix: job_bun_integration_tests
Matrix: job_bun_unit_tests
Matrix: job_bundler_plugin_integration_tests
Matrix: job_cloudflare_integration_tests
Matrix: job_deno_integration_tests
Matrix: job_node_integration_tests
Matrix: job_node_unit_tests
Check for faulty .d.ts files
35s
Check for faulty .d.ts files
Matrix: job_browser_loader_tests
Matrix: job_browser_playwright_tests
Matrix: job_optional_e2e_tests
Upload Artifacts
0s
Upload Artifacts
Matrix: job_e2e_tests
All required jobs passed or were skipped
3s
All required jobs passed or were skipped
Fit to window
Zoom out
Zoom in

Annotations

19 errors, 1 warning, and 266 notices
E2E sveltekit-2-static Test
Process completed with exit code 1.
Bun (1.3.14) Integration Tests (2/2)
Process completed with exit code 1.
[node-suites-sentry-bun] suites/public-api/captureException/suppressed-error/test.ts > SuppressedError > captures both errors of a SuppressedError as chained exceptions: dev-packages/node-integration-tests/utils/assertions.ts#L30
AssertionError: expected { …(11) } to match object { event_id: Any<String>, …(1) } (116 matching properties omitted from actual) - Expected + Received @@ -29,10 +29,10 @@ "exception_id": 0, "handled": true, "type": "generic", }, "type": "SuppressedError", - "value": StringContaining "suppressed during disposal", + "value": "", }, ], }, } ❯ assertSentryEvent utils/assertions.ts:30:18 ❯ expectErrorEvent utils/runner/createRunner.ts:1004:5 ❯ assertExpectedEnvelope utils/runner/createRunner.ts:1010:5 ❯ newEnvelope utils/runner/createRunner.ts:579:15 ❯ tryParseEnvelopeFromStdoutLine utils/runner/createRunner.ts:719:15 ❯ Socket.<anonymous> utils/runner/createRunner.ts:738:15
[node-suites] suites/public-api/captureException/suppressed-error/test.ts > SuppressedError > captures both errors of a SuppressedError as chained exceptions: dev-packages/node-integration-tests/utils/assertions.ts#L30
AssertionError: expected { …(11) } to match object { event_id: Any<String>, …(1) } (116 matching properties omitted from actual) - Expected + Received @@ -29,10 +29,10 @@ "exception_id": 0, "handled": true, "type": "generic", }, "type": "SuppressedError", - "value": StringContaining "suppressed during disposal", + "value": "", }, ], }, } ❯ assertSentryEvent utils/assertions.ts:30:18 ❯ expectErrorEvent utils/runner/createRunner.ts:1004:5 ❯ assertExpectedEnvelope utils/runner/createRunner.ts:1010:5 ❯ newEnvelope utils/runner/createRunner.ts:579:15 ❯ tryParseEnvelopeFromStdoutLine utils/runner/createRunner.ts:719:15 ❯ Socket.<anonymous> utils/runner/createRunner.ts:738:15
Bun (1.4) Integration Tests (2/2)
Process completed with exit code 1.
[node-suites-sentry-bun] suites/public-api/captureException/suppressed-error/test.ts > SuppressedError > captures both errors of a SuppressedError as chained exceptions: dev-packages/node-integration-tests/utils/assertions.ts#L30
AssertionError: expected { …(11) } to match object { event_id: Any<String>, …(1) } (116 matching properties omitted from actual) - Expected + Received @@ -29,10 +29,10 @@ "exception_id": 0, "handled": true, "type": "generic", }, "type": "SuppressedError", - "value": StringContaining "suppressed during disposal", + "value": "", }, ], }, } ❯ assertSentryEvent utils/assertions.ts:30:18 ❯ expectErrorEvent utils/runner/createRunner.ts:1004:5 ❯ assertExpectedEnvelope utils/runner/createRunner.ts:1010:5 ❯ newEnvelope utils/runner/createRunner.ts:579:15 ❯ tryParseEnvelopeFromStdoutLine utils/runner/createRunner.ts:719:15 ❯ Socket.<anonymous> utils/runner/createRunner.ts:738:15
[node-suites] suites/public-api/captureException/suppressed-error/test.ts > SuppressedError > captures both errors of a SuppressedError as chained exceptions: dev-packages/node-integration-tests/utils/assertions.ts#L30
AssertionError: expected { …(11) } to match object { event_id: Any<String>, …(1) } (116 matching properties omitted from actual) - Expected + Received @@ -29,10 +29,10 @@ "exception_id": 0, "handled": true, "type": "generic", }, "type": "SuppressedError", - "value": StringContaining "suppressed during disposal", + "value": "", }, ], }, } ❯ assertSentryEvent utils/assertions.ts:30:18 ❯ expectErrorEvent utils/runner/createRunner.ts:1004:5 ❯ assertExpectedEnvelope utils/runner/createRunner.ts:1010:5 ❯ newEnvelope utils/runner/createRunner.ts:579:15 ❯ tryParseEnvelopeFromStdoutLine utils/runner/createRunner.ts:719:15 ❯ Socket.<anonymous> utils/runner/createRunner.ts:738:15
Size Check
Error updating comment. This can happen for PR's originating from a fork without write permissions.
[chromium] › tests/performance.client.test.ts:50:3 › client-specific performance events › records manually added component tracking spans: ../../_temp/test-application/tests/utils.ts#L43
5) [chromium] › tests/performance.client.test.ts:50:3 › client-specific performance events › records manually added component tracking spans Error: page.waitForSelector: Test timeout of 30000ms exceeded. Call log: - waiting for locator('body.hydrated') to be visible at utils.ts:43 41 | page.goto(route), 42 | // the test app adds the "hydrated" class to the body when hydrating > 43 | page.waitForSelector('body.hydrated'), | ^ 44 | // also waiting for the initial pageload span so that later navigations don't interfere 45 | clientPageloadSpanPromise, 46 | ]); at waitForInitialPageload (/home/runner/work/_temp/test-application/tests/utils.ts:43:10) at /home/runner/work/_temp/test-application/tests/performance.client.test.ts:53:11
[chromium] › tests/performance.client.test.ts:50:3 › client-specific performance events › records manually added component tracking spans: ../../_temp/test-application/tests/performance.client.test.ts#L0
5) [chromium] › tests/performance.client.test.ts:50:3 › client-specific performance events › records manually added component tracking spans Test timeout of 30000ms exceeded.
[chromium] › tests/performance.client.test.ts:6:3 › client-specific performance events › multiple navigations have distinct traces: ../../_temp/test-application/tests/utils.ts#L43
4) [chromium] › tests/performance.client.test.ts:6:3 › client-specific performance events › multiple navigations have distinct traces Error: page.waitForSelector: Test timeout of 30000ms exceeded. Call log: - waiting for locator('body.hydrated') to be visible at utils.ts:43 41 | page.goto(route), 42 | // the test app adds the "hydrated" class to the body when hydrating > 43 | page.waitForSelector('body.hydrated'), | ^ 44 | // also waiting for the initial pageload span so that later navigations don't interfere 45 | clientPageloadSpanPromise, 46 | ]); at waitForInitialPageload (/home/runner/work/_temp/test-application/tests/utils.ts:43:10) at /home/runner/work/_temp/test-application/tests/performance.client.test.ts:19:11
[chromium] › tests/performance.client.test.ts:6:3 › client-specific performance events › multiple navigations have distinct traces: ../../_temp/test-application/tests/performance.client.test.ts#L0
4) [chromium] › tests/performance.client.test.ts:6:3 › client-specific performance events › multiple navigations have distinct traces Test timeout of 30000ms exceeded.
[chromium] › tests/load-dependencies.test.ts:5:1 › doesn't rerun a wrapped layout server load that doesn't depend on the url: ../../_temp/test-application/tests/utils.ts#L43
3) [chromium] › tests/load-dependencies.test.ts:5:1 › doesn't rerun a wrapped layout server load that doesn't depend on the url Error: page.waitForSelector: Test timeout of 30000ms exceeded. Call log: - waiting for locator('body.hydrated') to be visible at utils.ts:43 41 | page.goto(route), 42 | // the test app adds the "hydrated" class to the body when hydrating > 43 | page.waitForSelector('body.hydrated'), | ^ 44 | // also waiting for the initial pageload span so that later navigations don't interfere 45 | clientPageloadSpanPromise, 46 | ]); at waitForInitialPageload (/home/runner/work/_temp/test-application/tests/utils.ts:43:10) at /home/runner/work/_temp/test-application/tests/load-dependencies.test.ts:6:9
[chromium] › tests/load-dependencies.test.ts:5:1 › doesn't rerun a wrapped layout server load that doesn't depend on the url: ../../_temp/test-application/tests/load-dependencies.test.ts#L0
3) [chromium] › tests/load-dependencies.test.ts:5:1 › doesn't rerun a wrapped layout server load that doesn't depend on the url Test timeout of 30000ms exceeded.
[chromium] › tests/errors.client.test.ts:32:3 › client-side errors › captures universal load error: ../../_temp/test-application/tests/utils.ts#L43
2) [chromium] › tests/errors.client.test.ts:32:3 › client-side errors › captures universal load error Error: page.waitForSelector: Test timeout of 30000ms exceeded. Call log: - waiting for locator('body.hydrated') to be visible at utils.ts:43 41 | page.goto(route), 42 | // the test app adds the "hydrated" class to the body when hydrating > 43 | page.waitForSelector('body.hydrated'), | ^ 44 | // also waiting for the initial pageload span so that later navigations don't interfere 45 | clientPageloadSpanPromise, 46 | ]); at waitForInitialPageload (/home/runner/work/_temp/test-application/tests/utils.ts:43:10) at /home/runner/work/_temp/test-application/tests/errors.client.test.ts:33:11
[chromium] › tests/errors.client.test.ts:32:3 › client-side errors › captures universal load error: ../../_temp/test-application/tests/errors.client.test.ts#L0
2) [chromium] › tests/errors.client.test.ts:32:3 › client-side errors › captures universal load error Test timeout of 30000ms exceeded.
[chromium] › tests/errors.client.test.ts:6:3 › client-side errors › captures error thrown on click: ../../_temp/test-application/tests/utils.ts#L43
1) [chromium] › tests/errors.client.test.ts:6:3 › client-side errors › captures error thrown on click Error: page.waitForSelector: Test timeout of 30000ms exceeded. Call log: - waiting for locator('body.hydrated') to be visible at utils.ts:43 41 | page.goto(route), 42 | // the test app adds the "hydrated" class to the body when hydrating > 43 | page.waitForSelector('body.hydrated'), | ^ 44 | // also waiting for the initial pageload span so that later navigations don't interfere 45 | clientPageloadSpanPromise, 46 | ]); at waitForInitialPageload (/home/runner/work/_temp/test-application/tests/utils.ts:43:10) at /home/runner/work/_temp/test-application/tests/errors.client.test.ts:7:11
[chromium] › tests/errors.client.test.ts:6:3 › client-side errors › captures error thrown on click: ../../_temp/test-application/tests/errors.client.test.ts#L0
1) [chromium] › tests/errors.client.test.ts:6:3 › client-side errors › captures error thrown on click Test timeout of 30000ms exceeded.
All required jobs passed or were skipped
Process completed with exit code 1.
E2E sveltekit-2-static Test
No files were found with the provided path: /home/runner/work/_temp/test-application/test-results. No artifacts will be uploaded.
🎭 Playwright Run Summary
4 passed (4.6s)
🎭 Playwright Run Summary
4 passed (5.8s)
🎭 Playwright Run Summary
3 passed (3.7s)
🎭 Playwright Run Summary
11 skipped 2 passed (3.4s)
🎭 Playwright Run Summary
1 passed (3.0s)
🎭 Playwright Run Summary
1 skipped 19 passed (2.0s)
🎭 Playwright Run Summary
1 passed (5.8s)
🎭 Playwright Run Summary
7 passed (3.3s)
🎭 Playwright Run Summary
1 passed (2.9s)
🎭 Playwright Run Summary
2 passed (5.6s)
🎭 Playwright Run Summary
15 passed (9.1s)
🎭 Playwright Run Summary
1 passed (4.5s)
🎭 Playwright Run Summary
16 passed (10.2s)
🎭 Playwright Run Summary
77 passed (6.1s)
🎭 Playwright Run Summary
5 passed (5.7s)
🎭 Playwright Run Summary
9 passed (3.6s)
🎭 Playwright Run Summary
9 passed (3.7s)
🎭 Playwright Run Summary
8 passed (11.7s)
🎭 Playwright Run Summary
16 passed (20.2s)
🎭 Playwright Run Summary
10 passed (10.0s)
🎭 Playwright Run Summary
1 passed (3.6s)
🎭 Playwright Run Summary
1 passed (3.6s)
🎭 Playwright Run Summary
2 passed (3.4s)
🎭 Playwright Run Summary
7 passed (4.3s)
🎭 Playwright Run Summary
2 passed (15.6s)
🎭 Playwright Run Summary
3 passed (2.8s)
🎭 Playwright Run Summary
5 passed (11.7s)
🎭 Playwright Run Summary
1 skipped 19 passed (8.0s)
🎭 Playwright Run Summary
3 skipped 17 passed (8.2s)
🎭 Playwright Run Summary
12 passed (11.1s)
🎭 Playwright Run Summary
2 passed (2.7s)
🎭 Playwright Run Summary
3 passed (6.7s)
🎭 Playwright Run Summary
12 passed (20.5s)
🎭 Playwright Run Summary
3 passed (4.0s)
🎭 Playwright Run Summary
4 passed (3.8s)
🎭 Playwright Run Summary
11 passed (10.0s)
🎭 Playwright Run Summary
20 passed (13.6s)
🎭 Playwright Run Summary
16 passed (8.8s)
🎭 Playwright Run Summary
5 passed (14.3s)
🎭 Playwright Run Summary
9 passed (11.4s)
🎭 Playwright Run Summary
5 passed (10.1s)
🎭 Playwright Run Summary
4 passed (7.1s)
🎭 Playwright Run Summary
8 passed (8.2s)
🎭 Playwright Run Summary
7 passed (9.0s)
🎭 Playwright Run Summary
5 passed (9.9s)
🎭 Playwright Run Summary
1 passed (3.0s)
🎭 Playwright Run Summary
4 skipped 10 passed (14.9s)
🎭 Playwright Run Summary
25 skipped 2 passed (3.8s)
🎭 Playwright Run Summary
1 skipped 76 passed (15.4s)
🎭 Playwright Run Summary
25 passed (22.6s)
🎭 Playwright Run Summary
8 skipped 6 passed (10.4s)
🎭 Playwright Run Summary
4 passed (12.5s)
🎭 Playwright Run Summary
11 passed (9.9s)
🎭 Playwright Run Summary
5 passed (11.7s)
🎭 Playwright Run Summary
4 passed (3.3s)
🎭 Playwright Run Summary
16 passed (20.2s)
🎭 Playwright Run Summary
9 passed (14.9s)
🎭 Playwright Run Summary
1 skipped 76 passed (16.6s)
🎭 Playwright Run Summary
5 passed (8.9s)
🎭 Playwright Run Summary
4 passed (13.7s)
🎭 Playwright Run Summary
8 passed (9.2s)
🎭 Playwright Run Summary
24 skipped 3 passed (3.5s)
🎭 Playwright Run Summary
77 passed (15.6s)
🎭 Playwright Run Summary
5 passed (7.0s)
🎭 Playwright Run Summary
12 passed (9.3s)
🎭 Playwright Run Summary
3 passed (4.5s)
🎭 Playwright Run Summary
1 skipped 76 passed (14.0s)
🎭 Playwright Run Summary
3 passed (6.7s)
🎭 Playwright Run Summary
5 passed (12.5s)
🎭 Playwright Run Summary
2 skipped 14 passed (16.7s)
🎭 Playwright Run Summary
22 passed (17.9s)
🎭 Playwright Run Summary
4 passed (10.3s)
🎭 Playwright Run Summary
25 skipped 2 passed (3.0s)
🎭 Playwright Run Summary
6 passed (13.3s)
🎭 Playwright Run Summary
10 passed (22.1s)
🎭 Playwright Run Summary
8 passed (5.4s)
🎭 Playwright Run Summary
1 passed (17.7s)
🎭 Playwright Run Summary
1 passed (3.9s)
🎭 Playwright Run Summary
5 passed (12.4s)
🎭 Playwright Run Summary
25 skipped 2 passed (3.7s)
🎭 Playwright Run Summary
10 passed (12.8s)
🎭 Playwright Run Summary
9 passed (17.0s)
🎭 Playwright Run Summary
11 passed (9.5s)
🎭 Playwright Run Summary
2 skipped 10 passed (6.6s)
🎭 Playwright Run Summary
2 skipped 10 passed (6.7s)
🎭 Playwright Run Summary
4 passed (8.5s)
🎭 Playwright Run Summary
10 passed (21.8s)
🎭 Playwright Run Summary
77 passed (14.6s)
🎭 Playwright Run Summary
1 skipped 76 passed (15.7s)
🎭 Playwright Run Summary
3 passed (14.8s)
🎭 Playwright Run Summary
3 passed (11.4s)
🎭 Playwright Run Summary
9 passed (11.5s)
🎭 Playwright Run Summary
1 passed (4.7s)
🎭 Playwright Run Summary
4 passed (11.8s)
🎭 Playwright Run Summary
10 passed (19.1s)
🎭 Playwright Run Summary
6 passed (12.7s)
🎭 Playwright Run Summary
30 passed (30.4s)
🎭 Playwright Run Summary
2 passed (4.0s)
🎭 Playwright Run Summary
2 passed (3.6s)
🎭 Playwright Run Summary
6 passed (15.8s)
🎭 Playwright Run Summary
30 passed (32.7s)
🎭 Playwright Run Summary
9 passed (12.1s)
🎭 Playwright Run Summary
4 passed (10.1s)
🎭 Playwright Run Summary
5 passed (11.9s)
🎭 Playwright Run Summary
4 passed (35.1s)
🎭 Playwright Run Summary
4 passed (3.0s)
🎭 Playwright Run Summary
77 passed (15.4s)
🎭 Playwright Run Summary
10 passed (11.8s)
🎭 Playwright Run Summary
12 passed (41.2s)
🎭 Playwright Run Summary
23 passed (21.1s)
🎭 Playwright Run Summary
11 passed (18.2s)
🎭 Playwright Run Summary
20 passed (16.1s)
🎭 Playwright Run Summary
19 passed (31.4s)
🎭 Playwright Run Summary
9 passed (30.6s)
🎭 Playwright Run Summary
13 passed (32.3s)
🎭 Playwright Run Summary
5 passed (11.1s)
🎭 Playwright Run Summary
1 skipped 17 passed (32.8s)
🎭 Playwright Run Summary
9 passed (12.2s)
🎭 Playwright Run Summary
11 passed (19.7s)
🎭 Playwright Run Summary
12 passed (40.7s)
🎭 Playwright Run Summary
9 passed (37.3s)
🎭 Playwright Run Summary
2 passed (32.7s)
🎭 Playwright Run Summary
12 passed (17.2s)
🎭 Playwright Run Summary
12 passed (17.3s)
🎭 Playwright Run Summary
23 passed (21.3s)
🎭 Playwright Run Summary
1 skipped 12 passed (28.0s)
🎭 Playwright Run Summary
22 passed (36.7s)
🎭 Playwright Run Summary
10 passed (42.4s)
🎭 Playwright Run Summary
4 passed (3.0s)
🎭 Playwright Run Summary
3 passed (32.5s)
🎭 Playwright Run Summary
7 passed (7.8s)
🎭 Playwright Run Summary
12 passed (37.4s)
🎭 Playwright Run Summary
2 passed (5.0s)
🎭 Playwright Run Summary
15 passed (30.0s)
🎭 Playwright Run Summary
54 passed (33.0s)
🎭 Playwright Run Summary
23 passed (14.4s)
🎭 Playwright Run Summary
2 passed (36.8s)
🎭 Playwright Run Summary
12 passed (6.6s)
🎭 Playwright Run Summary
3 passed (18.6s)
🎭 Playwright Run Summary
3 passed (12.4s)
🎭 Playwright Run Summary
12 passed (30.8s)
🎭 Playwright Run Summary
15 passed (41.0s)
🎭 Playwright Run Summary
25 passed (55.0s)
🎭 Playwright Run Summary
4 passed (3.3s)
🎭 Playwright Run Summary
12 passed (20.1s)
🎭 Playwright Run Summary
6 passed (46.4s)
🎭 Playwright Run Summary
22 passed (45.7s)
🎭 Playwright Run Summary
2 skipped 7 passed (31.5s)
🎭 Playwright Run Summary
11 passed (39.5s)
🎭 Playwright Run Summary
7 passed (27.9s)
🎭 Playwright Run Summary
2 passed (16.6s)
🎭 Playwright Run Summary
13 passed (31.3s)
🎭 Playwright Run Summary
13 passed (42.2s)
🎭 Playwright Run Summary
15 passed (34.0s)
🎭 Playwright Run Summary
2 passed (29.9s)
🎭 Playwright Run Summary
10 passed (40.3s)
🎭 Playwright Run Summary
15 passed (41.1s)
🎭 Playwright Run Summary
12 passed (40.4s)
🎭 Playwright Run Summary
6 passed (34.4s)
🎭 Playwright Run Summary
5 skipped 17 passed (32.9s)
🎭 Playwright Run Summary
1 skipped 21 passed (21.2s)
🎭 Playwright Run Summary
10 passed (56.5s)
🎭 Playwright Run Summary
4 passed (25.7s)
🎭 Playwright Run Summary
4 passed (10.3s)
🎭 Playwright Run Summary
15 passed (31.4s)
🎭 Playwright Run Summary
10 passed (19.4s)
🎭 Playwright Run Summary
10 passed (13.0s)
🎭 Playwright Run Summary
8 passed (39.3s)
🎭 Playwright Run Summary
8 passed (15.6s)
🎭 Playwright Run Summary
10 passed (19.7s)
🎭 Playwright Run Summary
10 passed (6.1s)
🎭 Playwright Run Summary
22 passed (46.9s)
🎭 Playwright Run Summary
2 passed (18.1s)
🎭 Playwright Run Summary
13 passed (40.0s)
🎭 Playwright Run Summary
40 passed (35.0s)
🎭 Playwright Run Summary
17 passed (1.1m)
🎭 Playwright Run Summary
510 skipped 192 passed (21.7s)
🎭 Playwright Run Summary
11 passed (35.6s)
🎭 Playwright Run Summary
5 skipped 25 passed (7.6s)
🎭 Playwright Run Summary
8 skipped 22 passed (10.3s)
🎭 Playwright Run Summary
16 passed (1.3m)
🎭 Playwright Run Summary
15 passed (43.7s)
🎭 Playwright Run Summary
6 skipped 7 passed (33.1s)
🎭 Playwright Run Summary
13 passed (19.7s)
🎭 Playwright Run Summary
17 passed (1.0m)
🎭 Playwright Run Summary
2 passed (16.4s)
🎭 Playwright Run Summary
11 passed (40.3s)
🎭 Playwright Run Summary
13 passed (58.2s)
🎭 Playwright Run Summary
5 skipped 25 passed (13.3s)
🎭 Playwright Run Summary
3 passed (34.5s)
🎭 Playwright Run Summary
3 passed (5.2s)
🎭 Playwright Run Summary
7 skipped 23 passed (7.4s)
🎭 Playwright Run Summary
1 skipped 28 passed (1.2m)
🎭 Playwright Run Summary
2 passed (18.5s)
🎭 Playwright Run Summary
2 skipped 21 passed (38.9s)
🎭 Playwright Run Summary
4 skipped 17 passed (39.9s)
🎭 Playwright Run Summary
1 skipped 20 passed (32.7s)
🎭 Playwright Run Summary
3 passed (33.0s)
🎭 Playwright Run Summary
3 passed (12.1s)
🎭 Playwright Run Summary
505 skipped 197 passed (25.5s)
🎭 Playwright Run Summary
29 passed (1.3m)
🎭 Playwright Run Summary
1 skipped 28 passed (1.2m)
🎭 Playwright Run Summary
13 passed (47.6s)
🎭 Playwright Run Summary
13 passed (14.5s)
🎭 Playwright Run Summary
1 skipped 28 passed (1.1m)
🎭 Playwright Run Summary
4 skipped 12 passed (31.8s)
🎭 Playwright Run Summary
2 skipped 14 passed (15.1s)
🎭 Playwright Run Summary
2 passed (19.2s)
🎭 Playwright Run Summary
3 skipped 24 passed (46.7s)
🎭 Playwright Run Summary
29 passed (1.3m)
🎭 Playwright Run Summary
7 skipped 23 passed (12.3s)
🎭 Playwright Run Summary
4 skipped 12 passed (31.4s)
🎭 Playwright Run Summary
2 skipped 14 passed (16.2s)
🎭 Playwright Run Summary
1 skipped 29 passed (17.8s)
🎭 Playwright Run Summary
508 skipped 194 passed (29.4s)
🎭 Playwright Run Summary
4 skipped 26 passed (18.9s)
🎭 Playwright Run Summary
6 skipped 7 passed (47.8s)
🎭 Playwright Run Summary
13 passed (19.0s)
🎭 Playwright Run Summary
13 skipped 53 passed (1.3m)
🎭 Playwright Run Summary
374 skipped 328 passed (47.3s)
🎭 Playwright Run Summary
14 passed (19.0s)
🎭 Playwright Run Summary
373 skipped 329 passed (47.9s)
🎭 Playwright Run Summary
12 skipped 54 passed (1.9m)
🎭 Playwright Run Summary
4 skipped 172 passed (1.3m)
🎭 Playwright Run Summary
4 skipped 17 passed (1.3m)
🎭 Playwright Run Summary
1 skipped 20 passed (31.9s)
🎭 Playwright Run Summary
5 skipped 17 passed (1.4m)
🎭 Playwright Run Summary
1 skipped 21 passed (21.5s)
🎭 Playwright Run Summary
1 skipped 175 passed (1.4m)
🎭 Playwright Run Summary
4 skipped 171 passed (1.7m)
🎭 Playwright Run Summary
1 skipped 5 passed (25.5s)
🎭 Playwright Run Summary
58 passed (1.6m)
🎭 Playwright Run Summary
5 skipped 30 passed (1.6m)
🎭 Playwright Run Summary
4 skipped 31 passed (46.3s)
🎭 Playwright Run Summary
44 passed (2.6m)
🎭 Playwright Run Summary
6 skipped 169 passed (1.7m)
🎭 Playwright Run Summary
76 passed (2.2m)
🎭 Playwright Run Summary
194 skipped 508 passed (1.8m)
🎭 Playwright Run Summary
198 skipped 504 passed (1.8m)
🎭 Playwright Run Summary
1 skipped 6 passed (23.0s)
🎭 Playwright Run Summary
76 passed (2.3m)
🎭 Playwright Run Summary
57 skipped 645 passed (2.2m)
🎭 Playwright Run Summary
61 skipped 641 passed (2.2m)
🎭 Playwright Run Summary
15 skipped 32 passed (1.8m)
🎭 Playwright Run Summary
5 skipped 42 passed (1.3m)
🎭 Playwright Run Summary
1 skipped 5 passed (24.6s)
🎭 Playwright Run Summary
58 passed (1.6m)
🎭 Playwright Run Summary
61 skipped 641 passed (2.3m)
🎭 Playwright Run Summary
2 skipped 32 passed (2.0m)
🎭 Playwright Run Summary
2 skipped 32 passed (1.2m)
🎭 Playwright Run Summary
59 skipped 643 passed (2.3m)
🎭 Playwright Run Summary
190 skipped 512 passed (2.2m)
🎭 Playwright Run Summary
57 skipped 645 passed (2.4m)
🎭 Playwright Run Summary
1 skipped 6 passed (30.7s)
🎭 Playwright Run Summary
76 passed (2.5m)
🎭 Playwright Run Summary
22 skipped 44 passed (2.3m)
🎭 Playwright Run Summary
11 skipped 55 passed (1.9m)
🎭 Playwright Run Summary
22 skipped 44 passed (2.4m)
🎭 Playwright Run Summary
11 skipped 55 passed (1.8m)
🎭 Playwright Run Summary
2 skipped 32 passed (3.0m)
🎭 Playwright Run Summary
2 skipped 32 passed (1.3m)
🎭 Playwright Run Summary
19 skipped 47 passed (2.9m)
🎭 Playwright Run Summary
11 skipped 55 passed (1.8m)
🎭 Playwright Run Summary
11 failed [chromium] › tests/errors.client.test.ts:6:3 › client-side errors › captures error thrown on click [chromium] › tests/errors.client.test.ts:32:3 › client-side errors › captures universal load error [chromium] › tests/load-dependencies.test.ts:5:1 › doesn't rerun a wrapped layout server load that doesn't depend on the url [chromium] › tests/performance.client.test.ts:6:3 › client-specific performance events › multiple navigations have distinct traces [chromium] › tests/performance.client.test.ts:50:3 › client-specific performance events › records manually added component tracking spans [chromium] › tests/performance.test.ts:11:3 › performance events › capture a distributed pageload trace [chromium] › tests/performance.test.ts:51:3 › performance events › capture a distributed navigation trace [chromium] › tests/performance.test.ts:91:3 › performance events › record client-side universal load fetch span and trace [chromium] › tests/performance.test.ts:160:3 › performance events › captures a navigation span directly after pageload [chromium] › tests/performance.test.ts:220:3 › performance events › captures one navigation span per redirect [chromium] › tests/sdk.test.ts:5:3 › SDK-internal behavior › Doesn't inject fetch proxy script for SvelteKit>=2.16.0 8 passed (5.9m)
🎭 Playwright Run Summary
19 skipped 47 passed (3.8m)
🎭 Playwright Run Summary
11 skipped 55 passed (1.7m)

Artifacts

Produced during runtime
Name Size Digest
playwright-traces-job_e2e_playwright_tests-sveltekit-2
151 KB
sha256:aeb41846bb87750528ac2b4cbcdc1182b6e631f64e1792774a3b4c72449c59f2