Skip to content

fix(okhttp): Don't block on response bodies by reading the body upfront #14338

fix(okhttp): Don't block on response bodies by reading the body upfront

fix(okhttp): Don't block on response bodies by reading the body upfront #14338

Triggered via pull request October 27, 2026 08:30
Status Success
Total duration 10m 32s
Artifacts 6

agp-matrix.yml

on: pull_request
Matrix: agp-matrix-compatibility
Fit to window
Zoom out
Zoom in

Annotations

11 errors and 6 notices
io.sentry.uitest.android.ReplayTest ► composeReplayDoesNotLeak: sentry-android-integration-tests/sentry-uitest-android/build/outputs/androidTest-results/connected/release/TEST-test(AVD) - 11.xml#L0
Failed test found in: sentry-android-integration-tests/sentry-uitest-android/build/outputs/androidTest-results/connected/release/TEST-test(AVD) - 11.xml Error: org.junit.AssumptionViolatedException: got: <false>, expected: is <true>
io.sentry.uitest.android.ReplaySnapshotTest ► captureComposeReplayFrameSnapshots: sentry-android-integration-tests/sentry-uitest-android/build/outputs/androidTest-results/connected/release/TEST-test(AVD) - 11.xml#L0
Failed test found in: sentry-android-integration-tests/sentry-uitest-android/build/outputs/androidTest-results/connected/release/TEST-test(AVD) - 11.xml Error: org.junit.AssumptionViolatedException: got: <false>, expected: is <true>
io.sentry.uitest.android.EnvelopeTests ► checkEnvelopeProfiledTransaction: sentry-android-integration-tests/sentry-uitest-android/build/outputs/androidTest-results/connected/release/TEST-test(AVD) - 11.xml#L0
Failed test found in: sentry-android-integration-tests/sentry-uitest-android/build/outputs/androidTest-results/connected/release/TEST-test(AVD) - 11.xml Error: org.junit.AssumptionViolatedException: got: <[null]>, expected: every item is not null
io.sentry.uitest.android.EnvelopeTests ► checkTimedOutProfile: sentry-android-integration-tests/sentry-uitest-android/build/outputs/androidTest-results/connected/release/TEST-test(AVD) - 11.xml#L0
Failed test found in: sentry-android-integration-tests/sentry-uitest-android/build/outputs/androidTest-results/connected/release/TEST-test(AVD) - 11.xml Error: org.junit.AssumptionViolatedException: Sometimes traceFile does not exist for profiles on emulators and it fails. Although, Android Runtime is the one that manages the file, so something must be wrong with Debug.startMethodTracing
io.sentry.uitest.android.AutomaticSpansTest ► checkAppStartFramesMeasurements: sentry-android-integration-tests/sentry-uitest-android/build/outputs/androidTest-results/connected/release/TEST-test(AVD) - 11.xml#L0
Failed test found in: sentry-android-integration-tests/sentry-uitest-android/build/outputs/androidTest-results/connected/release/TEST-test(AVD) - 11.xml Error: org.junit.AssumptionViolatedException: got: <false>, expected: is <true>
io.sentry.uitest.android.UserInteractionTests ► composableSwipeGeneratesMatchingBreadcrumb: sentry-android-integration-tests/sentry-uitest-android/build/outputs/androidTest-results/connected/release/TEST-test(AVD) - 11.xml#L0
Failed test found in: sentry-android-integration-tests/sentry-uitest-android/build/outputs/androidTest-results/connected/release/TEST-test(AVD) - 11.xml Error: org.junit.AssumptionViolatedException: got: <false>, expected: is <true>
io.sentry.uitest.android.UserInteractionTests ► composableClickGeneratesMatchingBreadcrumb: sentry-android-integration-tests/sentry-uitest-android/build/outputs/androidTest-results/connected/release/TEST-test(AVD) - 11.xml#L0
Failed test found in: sentry-android-integration-tests/sentry-uitest-android/build/outputs/androidTest-results/connected/release/TEST-test(AVD) - 11.xml Error: org.junit.AssumptionViolatedException: got: <false>, expected: is <true>
io.sentry.uitest.android.ReplayTest ► composeReplayDoesNotLeak: sentry-android-integration-tests/sentry-uitest-android/build/outputs/androidTest-results/connected/release/TEST-test(AVD) - 11.xml#L0
Failed test found in: sentry-android-integration-tests/sentry-uitest-android/build/outputs/androidTest-results/connected/release/TEST-test(AVD) - 11.xml Error: org.junit.AssumptionViolatedException: got: <false>, expected: is <true>
io.sentry.uitest.android.EnvelopeTests ► checkEnvelopeProfiledTransaction: sentry-android-integration-tests/sentry-uitest-android/build/outputs/androidTest-results/connected/release/TEST-test(AVD) - 11.xml#L0
Failed test found in: sentry-android-integration-tests/sentry-uitest-android/build/outputs/androidTest-results/connected/release/TEST-test(AVD) - 11.xml Error: org.junit.AssumptionViolatedException: got: <[null]>, expected: every item is not null
io.sentry.uitest.android.EnvelopeTests ► checkTimedOutProfile: sentry-android-integration-tests/sentry-uitest-android/build/outputs/androidTest-results/connected/release/TEST-test(AVD) - 11.xml#L0
Failed test found in: sentry-android-integration-tests/sentry-uitest-android/build/outputs/androidTest-results/connected/release/TEST-test(AVD) - 11.xml Error: org.junit.AssumptionViolatedException: Sometimes traceFile does not exist for profiles on emulators and it fails. Although, Android Runtime is the one that manages the file, so something must be wrong with Debug.startMethodTracing
io.sentry.uitest.android.AutomaticSpansTest ► checkAppStartFramesMeasurements: sentry-android-integration-tests/sentry-uitest-android/build/outputs/androidTest-results/connected/release/TEST-test(AVD) - 11.xml#L0
Failed test found in: sentry-android-integration-tests/sentry-uitest-android/build/outputs/androidTest-results/connected/release/TEST-test(AVD) - 11.xml Error: org.junit.AssumptionViolatedException: got: <false>, expected: is <true>
AGP Matrix Release - AGP 9.4.0 - Integrations true
"The ubuntu-latest label will migrate to Ubuntu 26 beginning October 19, 2026. For more information, see https://github.com/actions/runner-images/issues/14748"
AGP Matrix Release - AGP 9.4.0 - Integrations false
"The ubuntu-latest label will migrate to Ubuntu 26 beginning October 19, 2026. For more information, see https://github.com/actions/runner-images/issues/14748"
AGP Matrix Release - AGP 9.2.1 - Integrations true
"The ubuntu-latest label will migrate to Ubuntu 26 beginning October 19, 2026. For more information, see https://github.com/actions/runner-images/issues/14748"
AGP Matrix Release - AGP 9.2.1 - Integrations false
"The ubuntu-latest label will migrate to Ubuntu 26 beginning October 19, 2026. For more information, see https://github.com/actions/runner-images/issues/14748"
AGP Matrix Release - AGP 9.0.0 - Integrations false
"The ubuntu-latest label will migrate to Ubuntu 26 beginning October 19, 2026. For more information, see https://github.com/actions/runner-images/issues/14748"
AGP Matrix Release - AGP 9.0.0 - Integrations true
"The ubuntu-latest label will migrate to Ubuntu 26 beginning October 19, 2026. For more information, see https://github.com/actions/runner-images/issues/14748"

Artifacts

Produced during runtime
Name Size Digest
test-results-AGP9.0.0-Integrationsfalse
7.18 MB
sha256:04cd3bfb1b88fec37d340d3c596afcd410c70fcbe0417cedceb79bfca33027a6
test-results-AGP9.0.0-Integrationstrue
7.3 MB
sha256:66cb05fc4eb2ae936acb37e036d9bafdb6e4282fad84d991ccf2e6e725dd0e80
test-results-AGP9.2.1-Integrationsfalse
19.1 MB
sha256:e6963f26c208452f81295a223a817750996e091e8f309fb6d9e1810d337e4975
test-results-AGP9.2.1-Integrationstrue
19.4 MB
sha256:5457e93e9ae4aee5531e79f693f0c74254b937fd43e5f50212ca473bd1c7c3af
test-results-AGP9.4.0-Integrationsfalse
19.4 MB
sha256:8345a6e52e6883d88bd2a89e175f1880b785b5ba2395ba4f757b61b8dbd7bae6
test-results-AGP9.4.0-Integrationstrue
19.8 MB
sha256:bb81bf68a7338e3681c83d5d234b6b6235c18005e130fc1f27eab0628c0620b4