Skip to content

test(async-profiler): [Sample Tests 33] Add an end-to-end test of a profiled transaction #14300

test(async-profiler): [Sample Tests 33] Add an end-to-end test of a profiled transaction

test(async-profiler): [Sample Tests 33] Add an end-to-end test of a profiled transaction #14300

Triggered via pull request October 23, 2026 15:12
Status Success
Total duration 12m 10s
Artifacts 6

agp-matrix.yml

on: pull_request
Matrix: agp-matrix-compatibility
Fit to window
Zoom out
Zoom in

Annotations

11 errors and 6 notices
io.sentry.uitest.android.ReplayTest ► composeReplayDoesNotLeak: sentry-android-integration-tests/sentry-uitest-android/build/outputs/androidTest-results/connected/release/TEST-test(AVD) - 11.xml#L0
Failed test found in: sentry-android-integration-tests/sentry-uitest-android/build/outputs/androidTest-results/connected/release/TEST-test(AVD) - 11.xml Error: org.junit.AssumptionViolatedException: got: <false>, expected: is <true>
io.sentry.uitest.android.ReplaySnapshotTest ► captureComposeReplayFrameSnapshots: sentry-android-integration-tests/sentry-uitest-android/build/outputs/androidTest-results/connected/release/TEST-test(AVD) - 11.xml#L0
Failed test found in: sentry-android-integration-tests/sentry-uitest-android/build/outputs/androidTest-results/connected/release/TEST-test(AVD) - 11.xml Error: org.junit.AssumptionViolatedException: got: <false>, expected: is <true>
io.sentry.uitest.android.EnvelopeTests ► checkEnvelopeProfiledTransaction: sentry-android-integration-tests/sentry-uitest-android/build/outputs/androidTest-results/connected/release/TEST-test(AVD) - 11.xml#L0
Failed test found in: sentry-android-integration-tests/sentry-uitest-android/build/outputs/androidTest-results/connected/release/TEST-test(AVD) - 11.xml Error: org.junit.AssumptionViolatedException: got: <[null]>, expected: every item is not null
io.sentry.uitest.android.EnvelopeTests ► checkTimedOutProfile: sentry-android-integration-tests/sentry-uitest-android/build/outputs/androidTest-results/connected/release/TEST-test(AVD) - 11.xml#L0
Failed test found in: sentry-android-integration-tests/sentry-uitest-android/build/outputs/androidTest-results/connected/release/TEST-test(AVD) - 11.xml Error: org.junit.AssumptionViolatedException: Sometimes traceFile does not exist for profiles on emulators and it fails. Although, Android Runtime is the one that manages the file, so something must be wrong with Debug.startMethodTracing
io.sentry.uitest.android.AutomaticSpansTest ► checkAppStartFramesMeasurements: sentry-android-integration-tests/sentry-uitest-android/build/outputs/androidTest-results/connected/release/TEST-test(AVD) - 11.xml#L0
Failed test found in: sentry-android-integration-tests/sentry-uitest-android/build/outputs/androidTest-results/connected/release/TEST-test(AVD) - 11.xml Error: org.junit.AssumptionViolatedException: got: <false>, expected: is <true>
io.sentry.uitest.android.UserInteractionTests ► composableSwipeGeneratesMatchingBreadcrumb: sentry-android-integration-tests/sentry-uitest-android/build/outputs/androidTest-results/connected/release/TEST-test(AVD) - 11.xml#L0
Failed test found in: sentry-android-integration-tests/sentry-uitest-android/build/outputs/androidTest-results/connected/release/TEST-test(AVD) - 11.xml Error: org.junit.AssumptionViolatedException: got: <false>, expected: is <true>
io.sentry.uitest.android.UserInteractionTests ► composableClickGeneratesMatchingBreadcrumb: sentry-android-integration-tests/sentry-uitest-android/build/outputs/androidTest-results/connected/release/TEST-test(AVD) - 11.xml#L0
Failed test found in: sentry-android-integration-tests/sentry-uitest-android/build/outputs/androidTest-results/connected/release/TEST-test(AVD) - 11.xml Error: org.junit.AssumptionViolatedException: got: <false>, expected: is <true>
io.sentry.uitest.android.ReplayTest ► composeReplayDoesNotLeak: sentry-android-integration-tests/sentry-uitest-android/build/outputs/androidTest-results/connected/release/TEST-test(AVD) - 11.xml#L0
Failed test found in: sentry-android-integration-tests/sentry-uitest-android/build/outputs/androidTest-results/connected/release/TEST-test(AVD) - 11.xml Error: org.junit.AssumptionViolatedException: got: <false>, expected: is <true>
io.sentry.uitest.android.EnvelopeTests ► checkEnvelopeProfiledTransaction: sentry-android-integration-tests/sentry-uitest-android/build/outputs/androidTest-results/connected/release/TEST-test(AVD) - 11.xml#L0
Failed test found in: sentry-android-integration-tests/sentry-uitest-android/build/outputs/androidTest-results/connected/release/TEST-test(AVD) - 11.xml Error: org.junit.AssumptionViolatedException: got: <[null]>, expected: every item is not null
io.sentry.uitest.android.EnvelopeTests ► checkTimedOutProfile: sentry-android-integration-tests/sentry-uitest-android/build/outputs/androidTest-results/connected/release/TEST-test(AVD) - 11.xml#L0
Failed test found in: sentry-android-integration-tests/sentry-uitest-android/build/outputs/androidTest-results/connected/release/TEST-test(AVD) - 11.xml Error: org.junit.AssumptionViolatedException: Sometimes traceFile does not exist for profiles on emulators and it fails. Although, Android Runtime is the one that manages the file, so something must be wrong with Debug.startMethodTracing
io.sentry.uitest.android.AutomaticSpansTest ► checkAppStartFramesMeasurements: sentry-android-integration-tests/sentry-uitest-android/build/outputs/androidTest-results/connected/release/TEST-test(AVD) - 11.xml#L0
Failed test found in: sentry-android-integration-tests/sentry-uitest-android/build/outputs/androidTest-results/connected/release/TEST-test(AVD) - 11.xml Error: org.junit.AssumptionViolatedException: got: <false>, expected: is <true>
AGP Matrix Release - AGP 9.0.0 - Integrations false
"The ubuntu-latest label will migrate to Ubuntu 26 beginning October 19, 2026. For more information, see https://github.com/actions/runner-images/issues/14748"
AGP Matrix Release - AGP 9.0.0 - Integrations true
"The ubuntu-latest label will migrate to Ubuntu 26 beginning October 19, 2026. For more information, see https://github.com/actions/runner-images/issues/14748"
AGP Matrix Release - AGP 9.4.0 - Integrations true
"The ubuntu-latest label will migrate to Ubuntu 26 beginning October 19, 2026. For more information, see https://github.com/actions/runner-images/issues/14748"
AGP Matrix Release - AGP 9.4.0 - Integrations false
"The ubuntu-latest label will migrate to Ubuntu 26 beginning October 19, 2026. For more information, see https://github.com/actions/runner-images/issues/14748"
AGP Matrix Release - AGP 9.2.1 - Integrations true
"The ubuntu-latest label will migrate to Ubuntu 26 beginning October 19, 2026. For more information, see https://github.com/actions/runner-images/issues/14748"
AGP Matrix Release - AGP 9.2.1 - Integrations false
"The ubuntu-latest label will migrate to Ubuntu 26 beginning October 19, 2026. For more information, see https://github.com/actions/runner-images/issues/14748"

Artifacts

Produced during runtime
Name Size Digest
test-results-AGP9.0.0-Integrationsfalse
7.18 MB
sha256:c0304badf83e149ebcd3f2bb72abf2b09c2242fb36a22b2cc773a728c1adc454
test-results-AGP9.0.0-Integrationstrue
7.31 MB
sha256:aff5f3df857f447ab5805a320c192924c21f6a49684827de9491439e6c43f812
test-results-AGP9.2.1-Integrationsfalse
19.1 MB
sha256:a908eb4df9a07e1260becada7c8854924a30ff52843357efbb1099fbf7bcdd57
test-results-AGP9.2.1-Integrationstrue
19.4 MB
sha256:08f1e2ade6707c9082cfb655be4a16114e0779dbdf5f8243fb848414ed470c06
test-results-AGP9.4.0-Integrationsfalse
19.4 MB
sha256:36e95b4d24ba836e9fb168b81ed891fe453f416156456d2040d1cfbf81714b04
test-results-AGP9.4.0-Integrationstrue
19.8 MB
sha256:be009b429ec0e4e8880c256a4ba2fcf82a4707baf52fd4b583ba4de35ceb5c95