Repository navigation
docs: [Sample Tests 40] Describe the in-module end-to-end tests instead of the system tests #14284
Annotations
11 errors, 2 warnings, and 6 notices
|
io.sentry.uitest.android.UserInteractionTests ► composableSwipeGeneratesMatchingBreadcrumb:
sentry-android-integration-tests/sentry-uitest-android/build/outputs/androidTest-results/connected/release/TEST-test(AVD) - 11.xml#L0
Failed test found in:
sentry-android-integration-tests/sentry-uitest-android/build/outputs/androidTest-results/connected/release/TEST-test(AVD) - 11.xml
Error:
org.junit.AssumptionViolatedException: got: <false>, expected: is <true>
|
|
io.sentry.uitest.android.UserInteractionTests ► composableClickGeneratesMatchingBreadcrumb:
sentry-android-integration-tests/sentry-uitest-android/build/outputs/androidTest-results/connected/release/TEST-test(AVD) - 11.xml#L0
Failed test found in:
sentry-android-integration-tests/sentry-uitest-android/build/outputs/androidTest-results/connected/release/TEST-test(AVD) - 11.xml
Error:
org.junit.AssumptionViolatedException: got: <false>, expected: is <true>
|
|
io.sentry.uitest.android.ReplayTest ► composeReplayDoesNotLeak:
sentry-android-integration-tests/sentry-uitest-android/build/outputs/androidTest-results/connected/release/TEST-test(AVD) - 11.xml#L0
Failed test found in:
sentry-android-integration-tests/sentry-uitest-android/build/outputs/androidTest-results/connected/release/TEST-test(AVD) - 11.xml
Error:
org.junit.AssumptionViolatedException: got: <false>, expected: is <true>
|
|
io.sentry.uitest.android.EnvelopeTests ► checkEnvelopeProfiledTransaction:
sentry-android-integration-tests/sentry-uitest-android/build/outputs/androidTest-results/connected/release/TEST-test(AVD) - 11.xml#L0
Failed test found in:
sentry-android-integration-tests/sentry-uitest-android/build/outputs/androidTest-results/connected/release/TEST-test(AVD) - 11.xml
Error:
org.junit.AssumptionViolatedException: got: <[null]>, expected: every item is not null
|
|
io.sentry.uitest.android.EnvelopeTests ► checkTimedOutProfile:
sentry-android-integration-tests/sentry-uitest-android/build/outputs/androidTest-results/connected/release/TEST-test(AVD) - 11.xml#L0
Failed test found in:
sentry-android-integration-tests/sentry-uitest-android/build/outputs/androidTest-results/connected/release/TEST-test(AVD) - 11.xml
Error:
org.junit.AssumptionViolatedException: Sometimes traceFile does not exist for profiles on emulators and it fails. Although, Android Runtime is the one that manages the file, so something must be wrong with Debug.startMethodTracing
|
|
io.sentry.uitest.android.AutomaticSpansTest ► checkAppStartFramesMeasurements:
sentry-android-integration-tests/sentry-uitest-android/build/outputs/androidTest-results/connected/release/TEST-test(AVD) - 11.xml#L0
Failed test found in:
sentry-android-integration-tests/sentry-uitest-android/build/outputs/androidTest-results/connected/release/TEST-test(AVD) - 11.xml
Error:
org.junit.AssumptionViolatedException: got: <false>, expected: is <true>
|
|
io.sentry.uitest.android.ReplayTest ► composeReplayDoesNotLeak:
sentry-android-integration-tests/sentry-uitest-android/build/outputs/androidTest-results/connected/release/TEST-test(AVD) - 11.xml#L0
Failed test found in:
sentry-android-integration-tests/sentry-uitest-android/build/outputs/androidTest-results/connected/release/TEST-test(AVD) - 11.xml
Error:
org.junit.AssumptionViolatedException: got: <false>, expected: is <true>
|
|
io.sentry.uitest.android.ReplaySnapshotTest ► captureComposeReplayFrameSnapshots:
sentry-android-integration-tests/sentry-uitest-android/build/outputs/androidTest-results/connected/release/TEST-test(AVD) - 11.xml#L0
Failed test found in:
sentry-android-integration-tests/sentry-uitest-android/build/outputs/androidTest-results/connected/release/TEST-test(AVD) - 11.xml
Error:
org.junit.AssumptionViolatedException: got: <false>, expected: is <true>
|
|
io.sentry.uitest.android.EnvelopeTests ► checkEnvelopeProfiledTransaction:
sentry-android-integration-tests/sentry-uitest-android/build/outputs/androidTest-results/connected/release/TEST-test(AVD) - 11.xml#L0
Failed test found in:
sentry-android-integration-tests/sentry-uitest-android/build/outputs/androidTest-results/connected/release/TEST-test(AVD) - 11.xml
Error:
org.junit.AssumptionViolatedException: got: <[null]>, expected: every item is not null
|
|
io.sentry.uitest.android.EnvelopeTests ► checkTimedOutProfile:
sentry-android-integration-tests/sentry-uitest-android/build/outputs/androidTest-results/connected/release/TEST-test(AVD) - 11.xml#L0
Failed test found in:
sentry-android-integration-tests/sentry-uitest-android/build/outputs/androidTest-results/connected/release/TEST-test(AVD) - 11.xml
Error:
org.junit.AssumptionViolatedException: Sometimes traceFile does not exist for profiles on emulators and it fails. Although, Android Runtime is the one that manages the file, so something must be wrong with Debug.startMethodTracing
|
|
io.sentry.uitest.android.AutomaticSpansTest ► checkAppStartFramesMeasurements:
sentry-android-integration-tests/sentry-uitest-android/build/outputs/androidTest-results/connected/release/TEST-test(AVD) - 11.xml#L0
Failed test found in:
sentry-android-integration-tests/sentry-uitest-android/build/outputs/androidTest-results/connected/release/TEST-test(AVD) - 11.xml
Error:
org.junit.AssumptionViolatedException: got: <false>, expected: is <true>
|
|
AGP Matrix Release - AGP 9.0.0 - Integrations true
Failed to restore: Failed to GetCacheEntryDownloadURL: Rate limited: Failed request: (429) Too Many Requests: rate limit exceeded
|
|
AGP Matrix Release - AGP 9.0.0 - Integrations true
You've hit a rate limit, your rate limit will reset in 9 seconds
|
|
AGP Matrix Release - AGP 9.4.0 - Integrations false
"The ubuntu-latest label will migrate to Ubuntu 26 beginning October 19, 2026. For more information, see https://github.com/actions/runner-images/issues/14748"
|
|
AGP Matrix Release - AGP 9.4.0 - Integrations true
"The ubuntu-latest label will migrate to Ubuntu 26 beginning October 19, 2026. For more information, see https://github.com/actions/runner-images/issues/14748"
|
|
AGP Matrix Release - AGP 9.2.1 - Integrations false
"The ubuntu-latest label will migrate to Ubuntu 26 beginning October 19, 2026. For more information, see https://github.com/actions/runner-images/issues/14748"
|
|
AGP Matrix Release - AGP 9.0.0 - Integrations false
"The ubuntu-latest label will migrate to Ubuntu 26 beginning October 19, 2026. For more information, see https://github.com/actions/runner-images/issues/14748"
|
|
AGP Matrix Release - AGP 9.2.1 - Integrations true
"The ubuntu-latest label will migrate to Ubuntu 26 beginning October 19, 2026. For more information, see https://github.com/actions/runner-images/issues/14748"
|
|
AGP Matrix Release - AGP 9.0.0 - Integrations true
"The ubuntu-latest label will migrate to Ubuntu 26 beginning October 19, 2026. For more information, see https://github.com/actions/runner-images/issues/14748"
|
Artifacts
Produced during runtime
| Name | Size | Digest | |
|---|---|---|---|
|
test-results-AGP9.0.0-Integrationsfalse
|
7.17 MB |
sha256:a20b2f6cc7007172cb3485609de0dd49239004593cb1c3d450fa84938b1cc87c
|
|
|
test-results-AGP9.0.0-Integrationstrue
|
7.31 MB |
sha256:4874d6ffe91bd3691dc178f3090b8fe7dab34ce1d9725ea38caf009f99a5bd34
|
|
|
test-results-AGP9.2.1-Integrationsfalse
|
19.1 MB |
sha256:9c339ef1df21decd40ef434ecca8dea3f625735e54bce32f664d5840d88a9ce1
|
|
|
test-results-AGP9.2.1-Integrationstrue
|
19.4 MB |
sha256:0184d12d89d83c4bcaa9eda34502cbe6164b47109de847d4a913e812fba72df2
|
|
|
test-results-AGP9.4.0-Integrationsfalse
|
19.4 MB |
sha256:cd3563258791d78e2c7c0d14f8a06e702a83c4eff891677369ee3f712a51bd40
|
|
|
test-results-AGP9.4.0-Integrationstrue
|
19.8 MB |
sha256:4ea5d81be1dae683e0650a90bf32f27cef41c20806fc993dd1fee19d43c6f36f
|
|