Skip to content

test(spring): [Sample Tests 28] Move the Spring 7 WAR sample's tests into the module #14277

test(spring): [Sample Tests 28] Move the Spring 7 WAR sample's tests into the module

test(spring): [Sample Tests 28] Move the Spring 7 WAR sample's tests into the module #14277

Triggered via pull request October 23, 2026 15:12
Status Failure
Total duration 18m 3s
Artifacts 5

agp-matrix.yml

on: pull_request
Matrix: agp-matrix-compatibility
Fit to window
Zoom out
Zoom in

Annotations

7 errors, 18 warnings, and 6 notices
AGP Matrix Release - AGP 9.4.0 - Integrations false
No test report files were found
AGP Matrix Release - AGP 9.4.0 - Integrations false
The process '/usr/bin/sh' failed with exit code 1
io.sentry.uitest.android.ReplayTest ► composeReplayDoesNotLeak: sentry-android-integration-tests/sentry-uitest-android/build/outputs/androidTest-results/connected/release/TEST-test(AVD) - 11.xml#L0
Failed test found in: sentry-android-integration-tests/sentry-uitest-android/build/outputs/androidTest-results/connected/release/TEST-test(AVD) - 11.xml Error: org.junit.AssumptionViolatedException: got: <false>, expected: is <true>
io.sentry.uitest.android.ReplaySnapshotTest ► captureComposeReplayFrameSnapshots: sentry-android-integration-tests/sentry-uitest-android/build/outputs/androidTest-results/connected/release/TEST-test(AVD) - 11.xml#L0
Failed test found in: sentry-android-integration-tests/sentry-uitest-android/build/outputs/androidTest-results/connected/release/TEST-test(AVD) - 11.xml Error: org.junit.AssumptionViolatedException: got: <false>, expected: is <true>
io.sentry.uitest.android.EnvelopeTests ► checkEnvelopeProfiledTransaction: sentry-android-integration-tests/sentry-uitest-android/build/outputs/androidTest-results/connected/release/TEST-test(AVD) - 11.xml#L0
Failed test found in: sentry-android-integration-tests/sentry-uitest-android/build/outputs/androidTest-results/connected/release/TEST-test(AVD) - 11.xml Error: org.junit.AssumptionViolatedException: got: <[null]>, expected: every item is not null
io.sentry.uitest.android.EnvelopeTests ► checkTimedOutProfile: sentry-android-integration-tests/sentry-uitest-android/build/outputs/androidTest-results/connected/release/TEST-test(AVD) - 11.xml#L0
Failed test found in: sentry-android-integration-tests/sentry-uitest-android/build/outputs/androidTest-results/connected/release/TEST-test(AVD) - 11.xml Error: org.junit.AssumptionViolatedException: Sometimes traceFile does not exist for profiles on emulators and it fails. Although, Android Runtime is the one that manages the file, so something must be wrong with Debug.startMethodTracing
io.sentry.uitest.android.AutomaticSpansTest ► checkAppStartFramesMeasurements: sentry-android-integration-tests/sentry-uitest-android/build/outputs/androidTest-results/connected/release/TEST-test(AVD) - 11.xml#L0
Failed test found in: sentry-android-integration-tests/sentry-uitest-android/build/outputs/androidTest-results/connected/release/TEST-test(AVD) - 11.xml Error: org.junit.AssumptionViolatedException: got: <false>, expected: is <true>
AGP Matrix Release - AGP 9.4.0 - Integrations false
No file matches path **/build/outputs/androidTest-results/**/*.xml
AGP Matrix Release - AGP 9.4.0 - Integrations false
No files were found with the provided path: **/build/reports/* **/build/outputs/*/connected/* **/build/outputs/mapping/release/*. No artifacts will be uploaded.
AGP Matrix Release - AGP 9.4.0 - Integrations false
Failed to restore: Failed to GetCacheEntryDownloadURL: Rate limited: Failed request: (429) Too Many Requests: rate limit exceeded
AGP Matrix Release - AGP 9.4.0 - Integrations false
You've hit a rate limit, your rate limit will reset in 41 seconds
AGP Matrix Release - AGP 9.4.0 - Integrations true
Failed to restore: Failed to GetCacheEntryDownloadURL: Rate limited: Failed request: (429) Too Many Requests: rate limit exceeded
AGP Matrix Release - AGP 9.4.0 - Integrations true
You've hit a rate limit, your rate limit will reset in 42 seconds
AGP Matrix Release - AGP 9.0.0 - Integrations true
Failed to restore: Failed to GetCacheEntryDownloadURL: Rate limited: Failed request: (429) Too Many Requests: rate limit exceeded
AGP Matrix Release - AGP 9.0.0 - Integrations true
You've hit a rate limit, your rate limit will reset in 37 seconds
AGP Matrix Release - AGP 9.2.1 - Integrations false
Failed to restore: Failed to GetCacheEntryDownloadURL: Rate limited: Failed request: (429) Too Many Requests: rate limit exceeded
AGP Matrix Release - AGP 9.2.1 - Integrations false
You've hit a rate limit, your rate limit will reset in 41 seconds
AGP Matrix Release - AGP 9.0.0 - Integrations false
Failed to restore: Failed to GetCacheEntryDownloadURL: Rate limited: Failed request: (429) Too Many Requests: rate limit exceeded
AGP Matrix Release - AGP 9.0.0 - Integrations false
You've hit a rate limit, your rate limit will reset in 40 seconds
AGP Matrix Release - AGP 9.0.0 - Integrations false
Failed to restore gradle-home-v2|Linux-X64|agp-matrix-compatibility[cef0db88047ff7046585672943c7c15b]-c72c6d1cdc35fd93fcb5af2d95c54e6284336b16: Error: Failed to GetCacheEntryDownloadURL: Rate limited: Failed request: (429) Too Many Requests: rate limit exceeded
AGP Matrix Release - AGP 9.0.0 - Integrations false
You've hit a rate limit, your rate limit will reset in 42 seconds
AGP Matrix Release - AGP 9.2.1 - Integrations true
Failed to restore: Failed to GetCacheEntryDownloadURL: Rate limited: Failed request: (429) Too Many Requests: rate limit exceeded
AGP Matrix Release - AGP 9.2.1 - Integrations true
You've hit a rate limit, your rate limit will reset in 43 seconds
AGP Matrix Release - AGP 9.2.1 - Integrations true
Failed to restore gradle-home-v2|Linux-X64|agp-matrix-compatibility[8529b8ab13b70d497ca29a106c395fc7]-c72c6d1cdc35fd93fcb5af2d95c54e6284336b16: Error: Failed to GetCacheEntryDownloadURL: Rate limited: Failed request: (429) Too Many Requests: rate limit exceeded
AGP Matrix Release - AGP 9.2.1 - Integrations true
You've hit a rate limit, your rate limit will reset in 43 seconds
AGP Matrix Release - AGP 9.4.0 - Integrations false
"The ubuntu-latest label will migrate to Ubuntu 26 beginning October 19, 2026. For more information, see https://github.com/actions/runner-images/issues/14748"
AGP Matrix Release - AGP 9.4.0 - Integrations true
"The ubuntu-latest label will migrate to Ubuntu 26 beginning October 19, 2026. For more information, see https://github.com/actions/runner-images/issues/14748"
AGP Matrix Release - AGP 9.0.0 - Integrations true
"The ubuntu-latest label will migrate to Ubuntu 26 beginning October 19, 2026. For more information, see https://github.com/actions/runner-images/issues/14748"
AGP Matrix Release - AGP 9.2.1 - Integrations false
"The ubuntu-latest label will migrate to Ubuntu 26 beginning October 19, 2026. For more information, see https://github.com/actions/runner-images/issues/14748"
AGP Matrix Release - AGP 9.0.0 - Integrations false
"The ubuntu-latest label will migrate to Ubuntu 26 beginning October 19, 2026. For more information, see https://github.com/actions/runner-images/issues/14748"
AGP Matrix Release - AGP 9.2.1 - Integrations true
"The ubuntu-latest label will migrate to Ubuntu 26 beginning October 19, 2026. For more information, see https://github.com/actions/runner-images/issues/14748"

Artifacts

Produced during runtime
Name Size Digest
test-results-AGP9.0.0-Integrationsfalse
7.18 MB
sha256:e378fc55776691cdd5ea6739635e9aa072cc6464b801ed479aace09530702626
test-results-AGP9.0.0-Integrationstrue
7.31 MB
sha256:d53535de83626ffb575a1e554a63ddc960a2694b5218a78708861595e18f4d04
test-results-AGP9.2.1-Integrationsfalse
19.1 MB
sha256:5b413018ebd13a0067e8e3fac5848daa8dc4b3c45f92cec58a3570fb78ceaf16
test-results-AGP9.2.1-Integrationstrue
19.4 MB
sha256:c04bd63e22bcc1df6a3745faa1f08a54042c0fbe89a2de79c973c9dba863368e
test-results-AGP9.4.0-Integrationstrue
19.8 MB
sha256:24423f1070f5e70db9ca4de74ce2fe799b96564b2e704a4bdd5e5947e0f9ca8d