Repository navigation
test(spring-boot): [Sample Tests 14] Move the Boot 2 GraphQL and Kafka tests #14153
Annotations
8 errors, 26 warnings, and 6 notices
|
AGP Matrix Release - AGP 9.4.0 - Integrations true
No test report files were found
|
|
AGP Matrix Release - AGP 9.4.0 - Integrations true
The process '/usr/bin/sh' failed with exit code 1
|
|
io.sentry.uitest.android.UserInteractionTests ► composableSwipeGeneratesMatchingBreadcrumb:
sentry-android-integration-tests/sentry-uitest-android/build/outputs/androidTest-results/connected/release/TEST-test(AVD) - 11.xml#L0
Failed test found in:
sentry-android-integration-tests/sentry-uitest-android/build/outputs/androidTest-results/connected/release/TEST-test(AVD) - 11.xml
Error:
org.junit.AssumptionViolatedException: got: <false>, expected: is <true>
|
|
io.sentry.uitest.android.UserInteractionTests ► composableClickGeneratesMatchingBreadcrumb:
sentry-android-integration-tests/sentry-uitest-android/build/outputs/androidTest-results/connected/release/TEST-test(AVD) - 11.xml#L0
Failed test found in:
sentry-android-integration-tests/sentry-uitest-android/build/outputs/androidTest-results/connected/release/TEST-test(AVD) - 11.xml
Error:
org.junit.AssumptionViolatedException: got: <false>, expected: is <true>
|
|
io.sentry.uitest.android.ReplayTest ► composeReplayDoesNotLeak:
sentry-android-integration-tests/sentry-uitest-android/build/outputs/androidTest-results/connected/release/TEST-test(AVD) - 11.xml#L0
Failed test found in:
sentry-android-integration-tests/sentry-uitest-android/build/outputs/androidTest-results/connected/release/TEST-test(AVD) - 11.xml
Error:
org.junit.AssumptionViolatedException: got: <false>, expected: is <true>
|
|
io.sentry.uitest.android.EnvelopeTests ► checkEnvelopeProfiledTransaction:
sentry-android-integration-tests/sentry-uitest-android/build/outputs/androidTest-results/connected/release/TEST-test(AVD) - 11.xml#L0
Failed test found in:
sentry-android-integration-tests/sentry-uitest-android/build/outputs/androidTest-results/connected/release/TEST-test(AVD) - 11.xml
Error:
org.junit.AssumptionViolatedException: got: <[null]>, expected: every item is not null
|
|
io.sentry.uitest.android.EnvelopeTests ► checkTimedOutProfile:
sentry-android-integration-tests/sentry-uitest-android/build/outputs/androidTest-results/connected/release/TEST-test(AVD) - 11.xml#L0
Failed test found in:
sentry-android-integration-tests/sentry-uitest-android/build/outputs/androidTest-results/connected/release/TEST-test(AVD) - 11.xml
Error:
org.junit.AssumptionViolatedException: Sometimes traceFile does not exist for profiles on emulators and it fails. Although, Android Runtime is the one that manages the file, so something must be wrong with Debug.startMethodTracing
|
|
io.sentry.uitest.android.AutomaticSpansTest ► checkAppStartFramesMeasurements:
sentry-android-integration-tests/sentry-uitest-android/build/outputs/androidTest-results/connected/release/TEST-test(AVD) - 11.xml#L0
Failed test found in:
sentry-android-integration-tests/sentry-uitest-android/build/outputs/androidTest-results/connected/release/TEST-test(AVD) - 11.xml
Error:
org.junit.AssumptionViolatedException: got: <false>, expected: is <true>
|
|
AGP Matrix Release - AGP 9.4.0 - Integrations true
No file matches path **/build/outputs/androidTest-results/**/*.xml
|
|
AGP Matrix Release - AGP 9.4.0 - Integrations true
No files were found with the provided path: **/build/reports/*
**/build/outputs/*/connected/*
**/build/outputs/mapping/release/*. No artifacts will be uploaded.
|
|
AGP Matrix Release - AGP 9.4.0 - Integrations true
Failed to restore: Failed to GetCacheEntryDownloadURL: Rate limited: Failed request: (429) Too Many Requests: rate limit exceeded
|
|
AGP Matrix Release - AGP 9.4.0 - Integrations true
You've hit a rate limit, your rate limit will reset in 19 seconds
|
|
AGP Matrix Release - AGP 9.4.0 - Integrations true
Failed to restore gradle-home-v2|Linux-X64|agp-matrix-compatibility[fce0e0853ecbba012de9a442479b7be7]-394275b16206ba7b25f4f37d9c16ba0a31d77324: Error: Failed to GetCacheEntryDownloadURL: Rate limited: Failed request: (429) Too Many Requests: rate limit exceeded
|
|
AGP Matrix Release - AGP 9.4.0 - Integrations true
You've hit a rate limit, your rate limit will reset in 19 seconds
|
|
AGP Matrix Release - AGP 9.2.1 - Integrations false
Failed to restore: Failed to GetCacheEntryDownloadURL: Rate limited: Failed request: (429) Too Many Requests: rate limit exceeded
|
|
AGP Matrix Release - AGP 9.2.1 - Integrations false
You've hit a rate limit, your rate limit will reset in 19 seconds
|
|
AGP Matrix Release - AGP 9.2.1 - Integrations false
Failed to restore gradle-home-v2|Linux-X64|agp-matrix-compatibility[dfe26173bcc1e7d4a93b4512afcb7b6e]-394275b16206ba7b25f4f37d9c16ba0a31d77324: Error: Failed to GetCacheEntryDownloadURL: Rate limited: Failed request: (429) Too Many Requests: rate limit exceeded
|
|
AGP Matrix Release - AGP 9.2.1 - Integrations false
You've hit a rate limit, your rate limit will reset in 20 seconds
|
|
AGP Matrix Release - AGP 9.4.0 - Integrations false
Failed to restore: Failed to GetCacheEntryDownloadURL: Rate limited: Failed request: (429) Too Many Requests: rate limit exceeded
|
|
AGP Matrix Release - AGP 9.4.0 - Integrations false
You've hit a rate limit, your rate limit will reset in 17 seconds
|
|
AGP Matrix Release - AGP 9.4.0 - Integrations false
Failed to restore gradle-home-v2|Linux-X64|agp-matrix-compatibility[b54df1593bb8c768787afd00c158b508]-394275b16206ba7b25f4f37d9c16ba0a31d77324: Error: Failed to GetCacheEntryDownloadURL: Rate limited: Failed request: (429) Too Many Requests: rate limit exceeded
|
|
AGP Matrix Release - AGP 9.4.0 - Integrations false
You've hit a rate limit, your rate limit will reset in 17 seconds
|
|
AGP Matrix Release - AGP 9.0.0 - Integrations false
Failed to restore: Failed to GetCacheEntryDownloadURL: Rate limited: Failed request: (429) Too Many Requests: rate limit exceeded
|
|
AGP Matrix Release - AGP 9.0.0 - Integrations false
You've hit a rate limit, your rate limit will reset in 14 seconds
|
|
AGP Matrix Release - AGP 9.0.0 - Integrations false
Failed to restore gradle-home-v2|Linux-X64|agp-matrix-compatibility[cef0db88047ff7046585672943c7c15b]-394275b16206ba7b25f4f37d9c16ba0a31d77324: Error: Failed to GetCacheEntryDownloadURL: Rate limited: Failed request: (429) Too Many Requests: rate limit exceeded
|
|
AGP Matrix Release - AGP 9.0.0 - Integrations false
You've hit a rate limit, your rate limit will reset in 14 seconds
|
|
AGP Matrix Release - AGP 9.2.1 - Integrations true
Failed to restore: Failed to GetCacheEntryDownloadURL: Rate limited: Failed request: (429) Too Many Requests: rate limit exceeded
|
|
AGP Matrix Release - AGP 9.2.1 - Integrations true
You've hit a rate limit, your rate limit will reset in 17 seconds
|
|
AGP Matrix Release - AGP 9.2.1 - Integrations true
Failed to restore gradle-home-v2|Linux-X64|agp-matrix-compatibility[8529b8ab13b70d497ca29a106c395fc7]-394275b16206ba7b25f4f37d9c16ba0a31d77324: Error: Failed to GetCacheEntryDownloadURL: Rate limited: Failed request: (429) Too Many Requests: rate limit exceeded
|
|
AGP Matrix Release - AGP 9.2.1 - Integrations true
You've hit a rate limit, your rate limit will reset in 18 seconds
|
|
AGP Matrix Release - AGP 9.0.0 - Integrations true
Failed to restore: Failed to GetCacheEntryDownloadURL: Rate limited: Failed request: (429) Too Many Requests: rate limit exceeded
|
|
AGP Matrix Release - AGP 9.0.0 - Integrations true
You've hit a rate limit, your rate limit will reset in 20 seconds
|
|
AGP Matrix Release - AGP 9.0.0 - Integrations true
Failed to restore gradle-home-v2|Linux-X64|agp-matrix-compatibility[a7282fc7d9f98e8ef70ac430bccd22cf]-394275b16206ba7b25f4f37d9c16ba0a31d77324: Error: Failed to GetCacheEntryDownloadURL: Rate limited: Failed request: (429) Too Many Requests: rate limit exceeded
|
|
AGP Matrix Release - AGP 9.0.0 - Integrations true
You've hit a rate limit, your rate limit will reset in 20 seconds
|
|
AGP Matrix Release - AGP 9.4.0 - Integrations true
"The ubuntu-latest label will migrate to Ubuntu 26 beginning October 19, 2026. For more information, see https://github.com/actions/runner-images/issues/14748"
|
|
AGP Matrix Release - AGP 9.2.1 - Integrations false
"The ubuntu-latest label will migrate to Ubuntu 26 beginning October 19, 2026. For more information, see https://github.com/actions/runner-images/issues/14748"
|
|
AGP Matrix Release - AGP 9.4.0 - Integrations false
"The ubuntu-latest label will migrate to Ubuntu 26 beginning October 19, 2026. For more information, see https://github.com/actions/runner-images/issues/14748"
|
|
AGP Matrix Release - AGP 9.0.0 - Integrations false
"The ubuntu-latest label will migrate to Ubuntu 26 beginning October 19, 2026. For more information, see https://github.com/actions/runner-images/issues/14748"
|
|
AGP Matrix Release - AGP 9.2.1 - Integrations true
"The ubuntu-latest label will migrate to Ubuntu 26 beginning October 19, 2026. For more information, see https://github.com/actions/runner-images/issues/14748"
|
|
AGP Matrix Release - AGP 9.0.0 - Integrations true
"The ubuntu-latest label will migrate to Ubuntu 26 beginning October 19, 2026. For more information, see https://github.com/actions/runner-images/issues/14748"
|
Artifacts
Produced during runtime
| Name | Size | Digest | |
|---|---|---|---|
|
test-results-AGP9.0.0-Integrationsfalse
|
7.17 MB |
sha256:89f87415d0deaf0886c2d14fc0b95d68cbe1f8c64dbe8ce2fc927afb724c66a6
|
|
|
test-results-AGP9.0.0-Integrationstrue
|
7.3 MB |
sha256:b8d1fa91ab936f72d0271fb359009dee5e050346662ab2c2da08c1359e8678e6
|
|
|
test-results-AGP9.2.1-Integrationsfalse
|
19.1 MB |
sha256:44d91e676ebfd1f378b24e0a4289e947a69a5b738255ba4e09a6dcf6a7ba1964
|
|
|
test-results-AGP9.2.1-Integrationstrue
|
19.4 MB |
sha256:c11a99bf78ff84ccbc042a475d4b81c7ffa72095707dfe68bf2762ec42cc7d0d
|
|
|
test-results-AGP9.4.0-Integrationsfalse
|
19.4 MB |
sha256:77bfac1e51aa2f87c1914630afdf21d21fca68c9d4ef56204c48b5a1ae112fd0
|
|